Kismet Wireless

Kismet Forums

 

Posted by:dragorn
Subject:libpcap issue
Date:14:26:23 23/03/2009

> panelfront.cc:1249: error: ‘new_panel’ was not declared in this scope
> panelfront.cc:1253: error: ‘struct PanelFront::kis_window’ has no member named ‘pan’
> panelfront.cc:1253: error: ‘move_panel’ was not declared in this scope
> panelfront.cc:1254: error: ‘struct PanelFront::kis_window’ has no member named ‘pan’
> panelfront.cc:1254: error: ‘show_panel’ was not declared in this scope
> panelfront.cc: In member function ‘void PanelFront::DestroyWindow(PanelFront::kis_window*)’:
> panelfront.cc:1277: error: ‘struct PanelFront::kis_window’ has no member named ‘pan’
> panelfront.cc:1277: error: ‘hide_panel’ was not declared in this scope
> panelfront.cc:1278: error: ‘struct PanelFront::kis_window’ has no member named ‘pan’
> panelfront.cc:1278: error: ‘del_panel’ was not declared in this scope
> make: *** [panelfront.o] Error 1
>
> There is quite a bit more of this. I checked and I am running gcc version 4.3 ( I saw something about panelfront here and it had to do with gcc so I checked). Any ideas? Thanks.

You're probably missing curses headers; w/out the start of the errors I couldn't tell you.

-m


Reply to this message