Kismet Wireless

Kismet Forums

 

Posted by:wifinder
Subject:Nokia n800 Capture source (Scratchbox build)
Date:15:40:06 30/09/2008

> > This has been bugging me for awhile, "FATAL: support for capture source 'nokia8x0' was not built". I built kismet for n800 last year no problem, newer release just wont work. I even gave up and tried the arm binaries packages for Debian, still same message. I fixed this problem before on my desktop, it was libpcap.
> >
> > n800 OS 2008
> >
> > Any help?
>
> Check the output from configure and see what's missing.
>
> I've still had very little luck getting stable rfmon out of the tablets so I've still be loathe to do a supported release.
>
> -m


I dont see anything missing, I had a look at this before, all my options were listed.





This file contains any messages produced by compilers while
running configure, to aid debugging if configure makes a mistake.

It was created by configure, which was
generated by GNU Autoconf 2.61. Invocation command line was

$ ./configure --disable-setuid --disable-gpsmap --disable-dbus

## --------- ##
## Platform. ##
## --------- ##

hostname = debian
uname -m = arm
uname -r = 2.6.18-4-686
uname -s = Linux
uname -v = #1 SMP Mon Mar 26 17:17:36 UTC 2007

/usr/bin/uname -p = unknown
/bin/uname -X = unknown

/bin/arch = arm
/usr/bin/arch -k = arm
/usr/convex/getsysinfo = unknown
/usr/bin/hostinfo = unknown
/bin/machine = unknown
/usr/bin/oslevel = unknown
/bin/universe = unknown

PATH: /scratchbox/devkits/cputransp/bin
PATH: /scratchbox/tools/bin
PATH: /targets/links/arch_tools/bin
PATH: /host_usr/bin
PATH: /scratchbox/compilers/bin
PATH: /bin
PATH: /usr/bin
PATH: /usr/local/bin
PATH: /usr/X11R6/bin
PATH: /sbin
PATH: /usr/sbin


## ----------- ##
## Core tests. ##
## ----------- ##

configure:1797: checking build system type
configure:1815: result: arm-unknown-linux-gnu
configure:1837: checking host system type
configure:1852: result: arm-unknown-linux-gnu
configure:1924: checking for gcc
configure:1940: found /scratchbox/compilers/bin/gcc
configure:1951: result: gcc
configure:2189: checking for C compiler version
configure:2196: gcc --version >&5
sbox-arm-linux-gcc (GCC) 3.4.4 (release) (CodeSourcery ARM 2005q3-2)
Copyright (C) 2004 Free Software Foundation, Inc.
This is free software; see the source for copying conditions. There is NO
warranty; not even for MERCHANTABILITY or FITNESS FOR A PARTICULAR PURPOSE.

configure:2199: $? = 0
configure:2206: gcc -v >&5
Reading specs from /scratchbox/compilers/cs2005q3.2-glibc-arm/lib/gcc/arm-none-linux-gnueabi/3.4.4/specs
Reading specs from /scratchbox/compilers/cs2005q3.2-glibc-arm/gcc.specs
rename spec cpp to old_cpp
Configured with: /home/kl/cs2005q3-2_toolchain/gcc/glibc/work/gcc-2005q3-2/configure --build=i386-linux --host=i386-linux --target=arm-none-linux-gnueabi --prefix=/scratchbox/compilers/cs2005q3.2-glibc-arm --with-headers=/scratchbox/compilers/cs2005q3.2-glibc-arm/usr/include --enable-languages=c,c++ --enable-shared --enable-threads --disable-checking --enable-symvers=gnu --program-prefix=arm-linux- --with-gnu-ld --enable-__cxa_atexit --disable-libssp --disable-libstdcxx-pch --with-cpu= --enable-interwork
Thread model: posix
gcc version 3.4.4 (release) (CodeSourcery ARM 2005q3-2)
configure:2209: $? = 0
configure:2216: gcc -V >&5
sbox-arm-linux-gcc: `-V' must come at the start of the command line
configure:2219: $? = 1
configure:2242: checking for C compiler default output file name
configure:2269: gcc conftest.c >&5
configure:2272: $? = 0
configure:2310: result: a.out
configure:2327: checking whether the C compiler works
configure:2337: ./a.out
configure:2340: $? = 0
configure:2357: result: yes
configure:2364: checking whether we are cross compiling
configure:2366: result: no
configure:2369: checking for suffix of executables
configure:2376: gcc -o conftest conftest.c >&5
configure:2379: $? = 0
configure:2403: result:
configure:2409: checking for suffix of object files
configure:2435: gcc -c conftest.c >&5
configure:2438: $? = 0
configure:2461: result: o
configure:2465: checking whether we are using the GNU C compiler
configure:2494: gcc -c conftest.c >&5
configure:2500: $? = 0
configure:2517: result: yes
configure:2522: checking whether gcc accepts -g
configure:2552: gcc -c -g conftest.c >&5
configure:2558: $? = 0
configure:2657: result: yes
configure:2674: checking for gcc option to accept ISO C89
configure:2748: gcc -c -g -O2 conftest.c >&5
configure:2754: $? = 0
configure:2777: result: none needed
configure:2853: checking for g++
configure:2869: found /scratchbox/compilers/bin/g++
configure:2880: result: g++
configure:2911: checking for C++ compiler version
configure:2918: g++ --version >&5
sbox-arm-linux-g++ (GCC) 3.4.4 (release) (CodeSourcery ARM 2005q3-2)
Copyright (C) 2004 Free Software Foundation, Inc.
This is free software; see the source for copying conditions. There is NO
warranty; not even for MERCHANTABILITY or FITNESS FOR A PARTICULAR PURPOSE.

configure:2921: $? = 0
configure:2928: g++ -v >&5
Reading specs from /scratchbox/compilers/cs2005q3.2-glibc-arm/lib/gcc/arm-none-linux-gnueabi/3.4.4/specs
Reading specs from /scratchbox/compilers/cs2005q3.2-glibc-arm/gcc.specs
rename spec cpp to old_cpp
Configured with: /home/kl/cs2005q3-2_toolchain/gcc/glibc/work/gcc-2005q3-2/configure --build=i386-linux --host=i386-linux --target=arm-none-linux-gnueabi --prefix=/scratchbox/compilers/cs2005q3.2-glibc-arm --with-headers=/scratchbox/compilers/cs2005q3.2-glibc-arm/usr/include --enable-languages=c,c++ --enable-shared --enable-threads --disable-checking --enable-symvers=gnu --program-prefix=arm-linux- --with-gnu-ld --enable-__cxa_atexit --disable-libssp --disable-libstdcxx-pch --with-cpu= --enable-interwork
Thread model: posix
gcc version 3.4.4 (release) (CodeSourcery ARM 2005q3-2)
configure:2931: $? = 0
configure:2938: g++ -V >&5
sbox-arm-linux-g++: argument to `-V' missing

configure:2941: $? = 1
configure:2944: checking whether we are using the GNU C++ compiler
configure:2973: g++ -c conftest.cpp >&5
configure:2979: $? = 0
configure:2996: result: yes
configure:3001: checking whether g++ accepts -g
configure:3031: g++ -c -g conftest.cpp >&5
configure:3037: $? = 0
configure:3136: result: yes
configure:3172: checking for a BSD-compatible install
configure:3228: result: /scratchbox/tools/bin/install -c
configure:3239: checking whether make sets $(MAKE)
configure:3260: result: yes
configure:3274: checking how to run the C preprocessor
configure:3314: gcc -E conftest.c
configure:3320: $? = 0
configure:3351: gcc -E conftest.c
conftest.c:8:28: ac_nonexistent.h: No such file or directory
configure:3357: $? = 1
configure: failed program was:
| /* confdefs.h. */
| #define PACKAGE_NAME ""
| #define PACKAGE_TARNAME ""
| #define PACKAGE_VERSION ""
| #define PACKAGE_STRING ""
| #define PACKAGE_BUGREPORT ""
| /* end confdefs.h. */
| #include <ac_nonexistent.h>
configure:3390: result: gcc -E
configure:3419: gcc -E conftest.c
configure:3425: $? = 0
configure:3456: gcc -E conftest.c
conftest.c:8:28: ac_nonexistent.h: No such file or directory
configure:3462: $? = 1
configure: failed program was:
| /* confdefs.h. */
| #define PACKAGE_NAME ""
| #define PACKAGE_TARNAME ""
| #define PACKAGE_VERSION ""
| #define PACKAGE_STRING ""
| #define PACKAGE_BUGREPORT ""
| /* end confdefs.h. */
| #include <ac_nonexistent.h>
configure:3504: checking for platform-specific compiler flags
configure:3625: result: none needed
configure:3735: checking for grep that handles long lines and -e
configure:3809: result: /scratchbox/tools/bin/grep
configure:3814: checking for egrep
configure:3892: result: /scratchbox/tools/bin/grep -E
configure:3897: checking for ANSI C header files
configure:3927: gcc -c -g -O2 conftest.c >&5
configure:3933: $? = 0
configure:4029: gcc -o conftest -g -O2 conftest.c >&5
configure:4032: $? = 0
configure:4038: ./conftest
configure:4041: $? = 0
configure:4058: result: yes
configure:4082: checking for sys/types.h
configure:4103: gcc -c -g -O2 conftest.c >&5
configure:4109: $? = 0
configure:4125: result: yes
configure:4082: checking for sys/stat.h
configure:4103: gcc -c -g -O2 conftest.c >&5
configure:4109: $? = 0
configure:4125: result: yes
configure:4082: checking for stdlib.h
configure:4103: gcc -c -g -O2 conftest.c >&5
configure:4109: $? = 0
configure:4125: result: yes
configure:4082: checking for string.h
configure:4103: gcc -c -g -O2 conftest.c >&5
configure:4109: $? = 0
configure:4125: result: yes
configure:4082: checking for memory.h
configure:4103: gcc -c -g -O2 conftest.c >&5
configure:4109: $? = 0
configure:4125: result: yes
configure:4082: checking for strings.h
configure:4103: gcc -c -g -O2 conftest.c >&5
configure:4109: $? = 0
configure:4125: result: yes
configure:4082: checking for inttypes.h
configure:4103: gcc -c -g -O2 conftest.c >&5
configure:4109: $? = 0
configure:4125: result: yes
configure:4082: checking for stdint.h
configure:4103: gcc -c -g -O2 conftest.c >&5
configure:4109: $? = 0
configure:4125: result: yes
configure:4082: checking for unistd.h
configure:4103: gcc -c -g -O2 conftest.c >&5
configure:4109: $? = 0
configure:4125: result: yes
configure:4137: checking whether byte ordering is bigendian
configure:4169: gcc -c -g -O2 conftest.c >&5
configure:4175: $? = 0
configure:4207: gcc -c -g -O2 conftest.c >&5
conftest.c: In function `main':
conftest.c:29: error: `not' undeclared (first use in this function)
conftest.c:29: error: (Each undeclared identifier is reported only once
conftest.c:29: error: for each function it appears in.)
conftest.c:29: error: syntax error before "big"
configure:4213: $? = 1
configure: failed program was:
| /* confdefs.h. */
| #define PACKAGE_NAME ""
| #define PACKAGE_TARNAME ""
| #define PACKAGE_VERSION ""
| #define PACKAGE_STRING ""
| #define PACKAGE_BUGREPORT ""
| #define SYS_LINUX 1
| #define SYSCONF_LOC "/usr/local/etc"
| #define LOCALSTATE_DIR "/usr/local/var"
| #define BIN_LOC "/usr/local/bin"
| #define STDC_HEADERS 1
| #define HAVE_SYS_TYPES_H 1
| #define HAVE_SYS_STAT_H 1
| #define HAVE_STDLIB_H 1
| #define HAVE_STRING_H 1
| #define HAVE_MEMORY_H 1
| #define HAVE_STRINGS_H 1
| #define HAVE_INTTYPES_H 1
| #define HAVE_STDINT_H 1
| #define HAVE_UNISTD_H 1
| /* end confdefs.h. */
| #include <sys/types.h>
| #include <sys/param.h>
|
| int
| main ()
| {
| #if BYTE_ORDER != BIG_ENDIAN
| not big endian
| #endif
|
| ;
| return 0;
| }
configure:4353: result: no
configure:4397: checking errno.h usability
configure:4414: gcc -c -g -O2 conftest.c >&5
configure:4420: $? = 0
configure:4434: result: yes
configure:4438: checking errno.h presence
configure:4453: gcc -E conftest.c
configure:4459: $? = 0
configure:4473: result: yes
configure:4501: checking for errno.h
configure:4509: result: yes
configure:4387: checking for stdlib.h
configure:4393: result: yes
configure:4387: checking for string.h
configure:4393: result: yes
configure:4397: checking sys/socket.h usability
configure:4414: gcc -c -g -O2 conftest.c >&5
configure:4420: $? = 0
configure:4434: result: yes
configure:4438: checking sys/socket.h presence
configure:4453: gcc -E conftest.c
configure:4459: $? = 0
configure:4473: result: yes
configure:4501: checking for sys/socket.h
configure:4509: result: yes
configure:4397: checking sys/time.h usability
configure:4414: gcc -c -g -O2 conftest.c >&5
configure:4420: $? = 0
configure:4434: result: yes
configure:4438: checking sys/time.h presence
configure:4453: gcc -E conftest.c
configure:4459: $? = 0
configure:4473: result: yes
configure:4501: checking for sys/time.h
configure:4509: result: yes
configure:4397: checking sys/wait.h usability
configure:4414: gcc -c -g -O2 conftest.c >&5
configure:4420: $? = 0
configure:4434: result: yes
configure:4438: checking sys/wait.h presence
configure:4453: gcc -E conftest.c
configure:4459: $? = 0
configure:4473: result: yes
configure:4501: checking for sys/wait.h
configure:4509: result: yes
configure:4387: checking for unistd.h
configure:4393: result: yes
configure:4387: checking for sys/types.h
configure:4393: result: yes
configure:4397: checking netdb.h usability
configure:4414: gcc -c -g -O2 conftest.c >&5
configure:4420: $? = 0
configure:4434: result: yes
configure:4438: checking netdb.h presence
configure:4453: gcc -E conftest.c
configure:4459: $? = 0
configure:4473: result: yes
configure:4501: checking for netdb.h
configure:4509: result: yes
configure:4546: checking getopt.h usability
configure:4563: gcc -c -g -O2 conftest.c >&5
configure:4569: $? = 0
configure:4583: result: yes
configure:4587: checking getopt.h presence
configure:4602: gcc -E conftest.c
configure:4608: $? = 0
configure:4622: result: yes
configure:4650: checking for getopt.h
configure:4658: result: yes
configure:4673: checking for an ANSI C-conforming const
configure:4748: gcc -c -g -O2 conftest.c >&5
configure:4754: $? = 0
configure:4769: result: yes
configure:4779: checking whether time.h and sys/time.h may both be included
configure:4809: gcc -c -g -O2 conftest.c >&5
configure:4815: $? = 0
configure:4830: result: yes
configure:4840: checking whether struct tm is in sys/time.h or time.h
configure:4870: gcc -c -g -O2 conftest.c >&5
configure:4876: $? = 0
configure:4891: result: time.h
configure:4903: checking for ANSI C header files
configure:5064: result: yes
configure:5074: checking return type of signal handlers
configure:5102: gcc -c -g -O2 conftest.c >&5
conftest.c: In function `main':
conftest.c:49: error: void value not ignored as it ought to be
configure:5108: $? = 1
configure: failed program was:
| /* confdefs.h. */
| #define PACKAGE_NAME ""
| #define PACKAGE_TARNAME ""
| #define PACKAGE_VERSION ""
| #define PACKAGE_STRING ""
| #define PACKAGE_BUGREPORT ""
| #define SYS_LINUX 1
| #define SYSCONF_LOC "/usr/local/etc"
| #define LOCALSTATE_DIR "/usr/local/var"
| #define BIN_LOC "/usr/local/bin"
| #define STDC_HEADERS 1
| #define HAVE_SYS_TYPES_H 1
| #define HAVE_SYS_STAT_H 1
| #define HAVE_STDLIB_H 1
| #define HAVE_STRING_H 1
| #define HAVE_MEMORY_H 1
| #define HAVE_STRINGS_H 1
| #define HAVE_INTTYPES_H 1
| #define HAVE_STDINT_H 1
| #define HAVE_UNISTD_H 1
| #define HAVE_ERRNO_H 1
| #define HAVE_SYSHEADERS 1
| #define HAVE_STDLIB_H 1
| #define HAVE_SYSHEADERS 1
| #define HAVE_STRING_H 1
| #define HAVE_SYSHEADERS 1
| #define HAVE_SYS_SOCKET_H 1
| #define HAVE_SYSHEADERS 1
| #define HAVE_SYS_TIME_H 1
| #define HAVE_SYSHEADERS 1
| #define HAVE_SYS_WAIT_H 1
| #define HAVE_SYSHEADERS 1
| #define HAVE_UNISTD_H 1
| #define HAVE_SYSHEADERS 1
| #define HAVE_SYS_TYPES_H 1
| #define HAVE_SYSHEADERS 1
| #define HAVE_NETDB_H 1
| #define HAVE_SYSHEADERS 1
| #define HAVE_GETOPT_H 1
| #define TIME_WITH_SYS_TIME 1
| #define STDC_HEADERS 1
| /* end confdefs.h. */
| #include <sys/types.h>
| #include <signal.h>
|
| int
| main ()
| {
| return *(signal (0, 0)) (0) == 1;
| ;
| return 0;
| }
configure:5123: result: void
configure:5131: checking whether lstat dereferences a symlink specified with a trailing slash
configure:5167: gcc -o conftest -g -O2 conftest.c >&5
configure:5170: $? = 0
configure:5176: ./conftest
configure:5179: $? = 0
configure:5202: result: yes
configure:5221: checking whether stat accepts an empty string
configure:5251: gcc -o conftest -g -O2 conftest.c >&5
configure:5254: $? = 0
configure:5260: ./conftest
configure:5263: $? = 0
configure:5279: result: no
configure:5305: checking for gettimeofday
configure:5361: gcc -o conftest -g -O2 conftest.c >&5
configure:5367: $? = 0
configure:5385: result: yes
configure:5305: checking for memset
configure:5361: gcc -o conftest -g -O2 conftest.c >&5
conftest.c:69: warning: conflicting types for built-in function 'memset'
configure:5367: $? = 0
configure:5385: result: yes
configure:5305: checking for select
configure:5361: gcc -o conftest -g -O2 conftest.c >&5
configure:5367: $? = 0
configure:5385: result: yes
configure:5305: checking for socket
configure:5361: gcc -o conftest -g -O2 conftest.c >&5
configure:5367: $? = 0
configure:5385: result: yes
configure:5305: checking for strcasecmp
configure:5361: gcc -o conftest -g -O2 conftest.c >&5
configure:5367: $? = 0
configure:5385: result: yes
configure:5305: checking for strftime
configure:5361: gcc -o conftest -g -O2 conftest.c >&5
conftest.c:73: warning: conflicting types for built-in function 'strftime'
configure:5367: $? = 0
configure:5385: result: yes
configure:5305: checking for strstr
configure:5361: gcc -o conftest -g -O2 conftest.c >&5
conftest.c:74: warning: conflicting types for built-in function 'strstr'
configure:5367: $? = 0
configure:5385: result: yes
configure:5397: checking for system-level getopt_long()
configure:5439: gcc -o conftest -g -O2 conftest.c >&5
configure:5445: $? = 0
configure:5462: result: yes
configure:5477: checking for stdint.h
configure:5482: result: yes
configure:5764: checking for accept() addrlen type
configure:5801: gcc -o conftest -Werror -g -O2 conftest.c >&5
configure:5807: $? = 0
configure:5824: result: socklen_t
configure:5845: checking for special C compiler options needed for large files
configure:5938: result: no
configure:5944: checking for _FILE_OFFSET_BITS value needed for large files
configure:5979: gcc -c -g -O2 conftest.c >&5
conftest.c:61: warning: left shift count >= width of type
conftest.c:61: warning: left shift count >= width of type
conftest.c:63: error: size of array `off_t_is_large' is negative
configure:5985: $? = 1
configure: failed program was:
| /* confdefs.h. */
| #define PACKAGE_NAME ""
| #define PACKAGE_TARNAME ""
| #define PACKAGE_VERSION ""
| #define PACKAGE_STRING ""
| #define PACKAGE_BUGREPORT ""
| #define SYS_LINUX 1
| #define SYSCONF_LOC "/usr/local/etc"
| #define LOCALSTATE_DIR "/usr/local/var"
| #define BIN_LOC "/usr/local/bin"
| #define STDC_HEADERS 1
| #define HAVE_SYS_TYPES_H 1
| #define HAVE_SYS_STAT_H 1
| #define HAVE_STDLIB_H 1
| #define HAVE_STRING_H 1
| #define HAVE_MEMORY_H 1
| #define HAVE_STRINGS_H 1
| #define HAVE_INTTYPES_H 1
| #define HAVE_STDINT_H 1
| #define HAVE_UNISTD_H 1
| #define HAVE_ERRNO_H 1
| #define HAVE_SYSHEADERS 1
| #define HAVE_STDLIB_H 1
| #define HAVE_SYSHEADERS 1
| #define HAVE_STRING_H 1
| #define HAVE_SYSHEADERS 1
| #define HAVE_SYS_SOCKET_H 1
| #define HAVE_SYSHEADERS 1
| #define HAVE_SYS_TIME_H 1
| #define HAVE_SYSHEADERS 1
| #define HAVE_SYS_WAIT_H 1
| #define HAVE_SYSHEADERS 1
| #define HAVE_UNISTD_H 1
| #define HAVE_SYSHEADERS 1
| #define HAVE_SYS_TYPES_H 1
| #define HAVE_SYSHEADERS 1
| #define HAVE_NETDB_H 1
| #define HAVE_SYSHEADERS 1
| #define HAVE_GETOPT_H 1
| #define TIME_WITH_SYS_TIME 1
| #define STDC_HEADERS 1
| #define RETSIGTYPE void
| #define LSTAT_FOLLOWS_SLASHED_SYMLINK 1
| #define HAVE_GETTIMEOFDAY 1
| #define HAVE_MEMSET 1
| #define HAVE_SELECT 1
| #define HAVE_SOCKET 1
| #define HAVE_STRCASECMP 1
| #define HAVE_STRFTIME 1
| #define HAVE_STRSTR 1
| #define HAVE_GETOPT_LONG 1
| #define HAVE_STDINT_H 1
| #define HAVE_SOCKLEN_T 1
| /* end confdefs.h. */
| #include <sys/types.h>
| /* Check that off_t can represent 2**63 - 1 correctly.
| We can't simply define LARGE_OFF_T to be 9223372036854775807,
| since some C++ compilers masquerading as C compilers
| incorrectly reject 9223372036854775807. */
| #define LARGE_OFF_T (((off_t) 1 << 62) - 1 + ((off_t) 1 << 62))
| int off_t_is_large[(LARGE_OFF_T % 2147483629 == 721
| && LARGE_OFF_T % 2147483647 == 1)
| ? 1 : -1];
| int
| main ()
| {
|
| ;
| return 0;
| }
configure:6029: gcc -c -g -O2 conftest.c >&5
configure:6035: $? = 0
configure:6053: result: 64
configure:6190: checking for main in -luClibc++
configure:6219: gcc -o conftest -g -O2 conftest.c -luClibc++ >&5
/scratchbox/compilers/cs2005q3.2-glibc-arm/lib/gcc/arm-none-linux-gnueabi/3.4.4/../../../../arm-none-linux-gnueabi/bin/ld: cannot find -luClibc++
collect2: ld returned 1 exit status
configure:6225: $? = 1
configure: failed program was:
| /* confdefs.h. */
| #define PACKAGE_NAME ""
| #define PACKAGE_TARNAME ""
| #define PACKAGE_VERSION ""
| #define PACKAGE_STRING ""
| #define PACKAGE_BUGREPORT ""
| #define SYS_LINUX 1
| #define SYSCONF_LOC "/usr/local/etc"
| #define LOCALSTATE_DIR "/usr/local/var"
| #define BIN_LOC "/usr/local/bin"
| #define STDC_HEADERS 1
| #define HAVE_SYS_TYPES_H 1
| #define HAVE_SYS_STAT_H 1
| #define HAVE_STDLIB_H 1
| #define HAVE_STRING_H 1
| #define HAVE_MEMORY_H 1
| #define HAVE_STRINGS_H 1
| #define HAVE_INTTYPES_H 1
| #define HAVE_STDINT_H 1
| #define HAVE_UNISTD_H 1
| #define HAVE_ERRNO_H 1
| #define HAVE_SYSHEADERS 1
| #define HAVE_STDLIB_H 1
| #define HAVE_SYSHEADERS 1
| #define HAVE_STRING_H 1
| #define HAVE_SYSHEADERS 1
| #define HAVE_SYS_SOCKET_H 1
| #define HAVE_SYSHEADERS 1
| #define HAVE_SYS_TIME_H 1
| #define HAVE_SYSHEADERS 1
| #define HAVE_SYS_WAIT_H 1
| #define HAVE_SYSHEADERS 1
| #define HAVE_UNISTD_H 1
| #define HAVE_SYSHEADERS 1
| #define HAVE_SYS_TYPES_H 1
| #define HAVE_SYSHEADERS 1
| #define HAVE_NETDB_H 1
| #define HAVE_SYSHEADERS 1
| #define HAVE_GETOPT_H 1
| #define TIME_WITH_SYS_TIME 1
| #define STDC_HEADERS 1
| #define RETSIGTYPE void
| #define LSTAT_FOLLOWS_SLASHED_SYMLINK 1
| #define HAVE_GETTIMEOFDAY 1
| #define HAVE_MEMSET 1
| #define HAVE_SELECT 1
| #define HAVE_SOCKET 1
| #define HAVE_STRCASECMP 1
| #define HAVE_STRFTIME 1
| #define HAVE_STRSTR 1
| #define HAVE_GETOPT_LONG 1
| #define HAVE_STDINT_H 1
| #define HAVE_SOCKLEN_T 1
| #define _FILE_OFFSET_BITS 64
| /* end confdefs.h. */
|
|
| int
| main ()
| {
| return main ();
| ;
| return 0;
| }
configure:6243: result: no
configure:6252: checking for main in -lstdc++
configure:6281: gcc -o conftest -g -O2 conftest.c -lstdc++ -lm >&5
configure:6287: $? = 0
configure:6305: result: yes
configure:6319: checking for group 'root'
configure:6326: result: yes
configure:6332: checking for group 'man'
configure:6393: checking for pkg-config
configure:6411: found /scratchbox/tools/bin/pkg-config
configure:6423: result: /scratchbox/tools/bin/pkg-config
configure:6452: checking pkg-config is at least version 0.9.0
configure:6455: result: yes
configure:6466: checking for pkghildon
configure:6474: $PKG_CONFIG --exists --print-errors "hildon-1 hildon-help dbus-1 conic"
Package hildon-1 was not found in the pkg-config search path.
Perhaps you should add the directory containing `hildon-1.pc'
to the PKG_CONFIG_PATH environment variable
No package 'hildon-1' found
configure:6477: $? = 1
configure:6492: $PKG_CONFIG --exists --print-errors "hildon-1 hildon-help dbus-1 conic"
Package hildon-1 was not found in the pkg-config search path.
Perhaps you should add the directory containing `hildon-1.pc'
to the PKG_CONFIG_PATH environment variable
No package 'hildon-1' found
configure:6495: $? = 1

configure:6523: result: no
configure:6575: checking for initscr in -lncurses
configure:6610: gcc -o conftest -g -O2 conftest.c -lncurses -lstdc++ -lm >&5
configure:6616: $? = 0
configure:6634: result: yes
configure:6731: checking for new_panel in -lpanel
configure:6766: gcc -o conftest -g -O2 conftest.c -lpanel -lncurses -lstdc++ -lm >&5
configure:6772: $? = 0
configure:6790: result: yes
configure:6886: checking for assume_default_colors in -lncurses
configure:6921: gcc -o conftest -g -O2 conftest.c -lncurses -lstdc++ -lm >&5
configure:6927: $? = 0
configure:6945: result: yes
configure:7000: checking for linux/netlink.h
configure:7025: gcc -c -g -O2 conftest.c >&5
configure:7031: $? = 0
configure:7046: result: yes
configure:7076: checking for linux/wireless.h
configure:7102: gcc -c -g -O2 conftest.c >&5
configure:7108: $? = 0
configure:7123: result: yes
configure:7139: checking that linux/wireless.h is what we expect
configure:7174: gcc -o conftest -g -O2 conftest.c -lstdc++ -lm >&5
configure:7180: $? = 0
configure:7203: result: yes
configure:7212: checking that wireless extentions support SIOCIWFIRSTPRIV
configure:7245: gcc -o conftest -g -O2 conftest.c -lstdc++ -lm >&5
configure:7251: $? = 0
configure:7274: result: yes
configure:7284: checking can we use iw_freq.flags
configure:7317: gcc -o conftest -g -O2 conftest.c -lstdc++ -lm >&5
configure:7323: $? = 0
configure:7344: result: yes
configure:7547: checking for pcap_open_live in -lpcap
configure:7582: gcc -o conftest -g -O2 conftest.c -lpcap -lstdc++ -lm >&5
configure:7588: $? = 0
configure:7607: result: yes
configure:7633: checking pcap.h usability
configure:7650: gcc -c -g -O2 conftest.c >&5
configure:7656: $? = 0
configure:7670: result: yes
configure:7674: checking pcap.h presence
configure:7689: gcc -E conftest.c
configure:7695: $? = 0
configure:7709: result: yes
configure:7737: checking for pcap.h
configure:7744: result: yes
configure:7902: checking for pcap_setnonblock in -lpcap
configure:7937: gcc -o conftest -g -O2 conftest.c -lpcap -lstdc++ -lm >&5
configure:7943: $? = 0
configure:7961: result: yes
configure:7977: checking for pcap_get_selectable_fd in -lpcap
configure:8012: gcc -o conftest -g -O2 conftest.c -lpcap -lstdc++ -lm >&5
configure:8018: $? = 0
configure:8037: result: yes
configure:8426: WARNING: Using local radiotap support on a non-bsd system
configure:8638: checking for setuid
configure:8640: result: no
configure:8644: WARNING: *** Not installing setuid capabilities. It is more secure to install Kismet as setuid-capable so it can drop privileges. Please consult the README file. ***
configure:9697: WARNING: *** --disable-gpsmap was specified. gpsmap will not be built ***
configure:9978: creating ./config.status

## ---------------------- ##
## Running config.status. ##
## ---------------------- ##

This file was extended by config.status, which was
generated by GNU Autoconf 2.61. Invocation command line was

CONFIG_FILES =
CONFIG_HEADERS =
CONFIG_LINKS =
CONFIG_COMMANDS =
$ ./config.status

on debian

config.status:633: creating Makefile
config.status:633: creating extra/buzzme/Makefile
config.status:633: creating extra/Makefile
config.status:768: WARNING: extra/Makefile.in seems to ignore the --datarootdir setting
config.status:633: creating conf/kismet.conf
config.status:633: creating conf/kismet_ui.conf
config.status:633: creating config.h

## ---------------- ##
## Cache variables. ##
## ---------------- ##

ac_cv_build=arm-unknown-linux-gnu
ac_cv_c_bigendian=no
ac_cv_c_compiler_gnu=yes
ac_cv_c_const=yes
ac_cv_cxx_compiler_gnu=yes
ac_cv_env_CCC_set=
ac_cv_env_CCC_value=
ac_cv_env_CC_set=
ac_cv_env_CC_value=
ac_cv_env_CFLAGS_set=
ac_cv_env_CFLAGS_value=
ac_cv_env_CPPFLAGS_set=
ac_cv_env_CPPFLAGS_value=
ac_cv_env_CPP_set=
ac_cv_env_CPP_value=
ac_cv_env_CXXFLAGS_set=
ac_cv_env_CXXFLAGS_value=
ac_cv_env_CXX_set=
ac_cv_env_CXX_value=
ac_cv_env_DBUS_CFLAGS_set=
ac_cv_env_DBUS_CFLAGS_value=
ac_cv_env_DBUS_LIBS_set=
ac_cv_env_DBUS_LIBS_value=
ac_cv_env_LDFLAGS_set=
ac_cv_env_LDFLAGS_value=
ac_cv_env_LIBS_set=
ac_cv_env_LIBS_value=
ac_cv_env_PKG_CONFIG_set=
ac_cv_env_PKG_CONFIG_value=
ac_cv_env_build_alias_set=
ac_cv_env_build_alias_value=
ac_cv_env_host_alias_set=
ac_cv_env_host_alias_value=
ac_cv_env_pkghildon_CFLAGS_set=
ac_cv_env_pkghildon_CFLAGS_value=
ac_cv_env_pkghildon_LIBS_set=
ac_cv_env_pkghildon_LIBS_value=
ac_cv_env_target_alias_set=
ac_cv_env_target_alias_value=
ac_cv_func_gettimeofday=yes
ac_cv_func_lstat_dereferences_slashed_symlink=yes
ac_cv_func_memset=yes
ac_cv_func_select=yes
ac_cv_func_socket=yes
ac_cv_func_stat_empty_string_bug=no
ac_cv_func_strcasecmp=yes
ac_cv_func_strftime=yes
ac_cv_func_strstr=yes
ac_cv_header_errno_h=yes
ac_cv_header_getopt_h=yes
ac_cv_header_inttypes_h=yes
ac_cv_header_linux_netlink_h=yes
ac_cv_header_linux_wireless_h=yes
ac_cv_header_memory_h=yes
ac_cv_header_netdb_h=yes
ac_cv_header_pcap_h=yes
ac_cv_header_stdc=yes
ac_cv_header_stdint_h=yes
ac_cv_header_stdlib_h=yes
ac_cv_header_string_h=yes
ac_cv_header_strings_h=yes
ac_cv_header_sys_socket_h=yes
ac_cv_header_sys_stat_h=yes
ac_cv_header_sys_time_h=yes
ac_cv_header_sys_types_h=yes
ac_cv_header_sys_wait_h=yes
ac_cv_header_time=yes
ac_cv_header_unistd_h=yes
ac_cv_host=arm-unknown-linux-gnu
ac_cv_lib_ncurses_assume_default_colors=yes
ac_cv_lib_ncurses_initscr=yes
ac_cv_lib_panel_new_panel=yes
ac_cv_lib_pcap___pcap_get_selectable_fd=yes
ac_cv_lib_pcap___pcap_open_live=yes
ac_cv_lib_pcap_pcap_setnonblock=yes
ac_cv_lib_stdcpp_main=yes
ac_cv_lib_uClibcpp_main=no
ac_cv_objext=o
ac_cv_path_EGREP='/scratchbox/tools/bin/grep -E'
ac_cv_path_GREP=/scratchbox/tools/bin/grep
ac_cv_path_ac_pt_PKG_CONFIG=/scratchbox/tools/bin/pkg-config
ac_cv_path_install='/scratchbox/tools/bin/install -c'
ac_cv_prog_CPP='gcc -E'
ac_cv_prog_ac_ct_CC=gcc
ac_cv_prog_ac_ct_CXX=g++
ac_cv_prog_cc_c89=
ac_cv_prog_cc_g=yes
ac_cv_prog_cxx_g=yes
ac_cv_prog_make_make_set=yes
ac_cv_struct_tm=time.h
ac_cv_sys_file_offset_bits=64
ac_cv_sys_largefile_CC=no
ac_cv_type_signal=void

## ----------------- ##
## Output variables. ##
## ----------------- ##

CC='gcc'
CFLAGS='-g -O2'
CLIBS=' -lpanel -lncurses'
CPP='gcc -E'
CPPFLAGS=''
CXX='g++'
CXXFLAGS='-g -O2'
DBUS_CFLAGS=''
DBUS_LIBS=''
DEFS='-DHAVE_CONFIG_H'
ECHO_C=''
ECHO_N='-n'
ECHO_T=''
EGREP='/scratchbox/tools/bin/grep -E'
EXEEXT=''
GREP='/scratchbox/tools/bin/grep'
INSTALL_DATA='${INSTALL} -m 644'
INSTALL_PROGRAM='${INSTALL}'
INSTALL_SCRIPT='${INSTALL}'
LDFLAGS=''
LIBOBJS=''
LIBS=' -lstdc++ -lm'
LTLIBOBJS=''
OBJEXT='o'
PACKAGE_BUGREPORT=''
PACKAGE_NAME=''
PACKAGE_STRING=''
PACKAGE_TARNAME=''
PACKAGE_VERSION=''
PATH_SEPARATOR=':'
PKG_CONFIG='/scratchbox/tools/bin/pkg-config'
SET_MAKE=''
SHELL='/bin/sh'
ac_ct_CC='gcc'
ac_ct_CXX='g++'
bindir='${exec_prefix}/bin'
build='arm-unknown-linux-gnu'
build_alias=''
build_cpu='arm'
build_os='linux-gnu'
build_vendor='unknown'
datadir='${datarootdir}'
datarootdir='${prefix}/share'
docdir='${datarootdir}/doc/${PACKAGE}'
dvidir='${docdir}'
exec_prefix='${prefix}'
gpslc=''
gpslco=''
host='arm-unknown-linux-gnu'
host_alias=''
host_cpu='arm'
host_os='linux-gnu'
host_vendor='unknown'
htmldir='${docdir}'
includedir='${prefix}/include'
infodir='${datarootdir}/info'
instgrp='root'
libdir='${exec_prefix}/lib'
libexecdir='${exec_prefix}/libexec'
local='yes'
localedir='${datarootdir}/locale'
localstatedir='${prefix}/var'
magickconfig=''
mandir='${datarootdir}/man'
mangrp='man'
objc_link=''
oldincludedir='/usr/include'
pcap='yes'
pcaplnk='-lpcap'
pdfdir='${docdir}'
pkghildon_CFLAGS=''
pkghildon_LIBS=''
prefix='/usr/local'
program_transform_name='s,x,x,'
psdir='${docdir}'
sbindir='${exec_prefix}/sbin'
sharedatadir='${prefix}/share'
sharedstatedir='${prefix}/com'
suid=''
sysconfdir='${prefix}/etc'
target_alias=''
threadlib=''
wantgpsmap='no'
wantnetlink='yes'
wantpcap='yes'
wantwireless='yes'

## ----------- ##
## confdefs.h. ##
## ----------- ##

#define PACKAGE_NAME ""
#define PACKAGE_TARNAME ""
#define PACKAGE_VERSION ""
#define PACKAGE_STRING ""
#define PACKAGE_BUGREPORT ""
#define SYS_LINUX 1
#define SYSCONF_LOC "/usr/local/etc"
#define LOCALSTATE_DIR "/usr/local/var"
#define BIN_LOC "/usr/local/bin"
#define STDC_HEADERS 1
#define HAVE_SYS_TYPES_H 1
#define HAVE_SYS_STAT_H 1
#define HAVE_STDLIB_H 1
#define HAVE_STRING_H 1
#define HAVE_MEMORY_H 1
#define HAVE_STRINGS_H 1
#define HAVE_INTTYPES_H 1
#define HAVE_STDINT_H 1
#define HAVE_UNISTD_H 1
#define HAVE_ERRNO_H 1
#define HAVE_SYSHEADERS 1
#define HAVE_STDLIB_H 1
#define HAVE_SYSHEADERS 1
#define HAVE_STRING_H 1
#define HAVE_SYSHEADERS 1
#define HAVE_SYS_SOCKET_H 1
#define HAVE_SYSHEADERS 1
#define HAVE_SYS_TIME_H 1
#define HAVE_SYSHEADERS 1
#define HAVE_SYS_WAIT_H 1
#define HAVE_SYSHEADERS 1
#define HAVE_UNISTD_H 1
#define HAVE_SYSHEADERS 1
#define HAVE_SYS_TYPES_H 1
#define HAVE_SYSHEADERS 1
#define HAVE_NETDB_H 1
#define HAVE_SYSHEADERS 1
#define HAVE_GETOPT_H 1
#define TIME_WITH_SYS_TIME 1
#define STDC_HEADERS 1
#define RETSIGTYPE void
#define LSTAT_FOLLOWS_SLASHED_SYMLINK 1
#define HAVE_GETTIMEOFDAY 1
#define HAVE_MEMSET 1
#define HAVE_SELECT 1
#define HAVE_SOCKET 1
#define HAVE_STRCASECMP 1
#define HAVE_STRFTIME 1
#define HAVE_STRSTR 1
#define HAVE_GETOPT_LONG 1
#define HAVE_STDINT_H 1
#define HAVE_SOCKLEN_T 1
#define _FILE_OFFSET_BITS 64
#define BUILD_CURSES 1
#define HAVE_LIBNCURSES 1
#define HAVE_LIBPANEL 1
#define BUILD_PANEL 1
#define HAVE_ASSUME_DEFAULT_COLORS 1
#define HAVE_LINUX_NETLINK 1
#define HAVE_LINUX_WIRELESS 1
#define HAVE_LINUX_WIRELESS22 1
#define HAVE_LINUX_IWFREQFLAG 1
#define HAVE_LIBPCAP 1
#define HAVE_PCAP_H 1
#define HAVE_PCAP_NONBLOCK 1
#define HAVE_PCAP_GETSELFD 1
#define HAVE_RADIOTAP 1
#define USE_LOCAL_DUMP 1
#define HAVE_GPS 1

configure: exit 0


Reply to this message