Kismet Wireless

Kismet Forums

 

Posted by:schjetne
Subject:Problems installing Kismet on MacBook
Date:22:14:56 12/09/2006

I'm a complete *nix noob, and actially struggled a fair bit just coming this far, so my disappointment was huge when I couldn't get <em>make</em> to install the damn thing... Here's all the messages:

<code>g++ -Ilibpcap-0.9.1-kis -O2 -Wall -DVERSION_MAJOR=\"2006\" -DVERSION_MINOR=\"04\" -DVERSION_TINY=\"R1\" -DTIMESTAMP=\"`cat TIMESTAMP`\" -g -O2 -no-cpp-precomp -g -O2 -c pcapsource.cc -o pcapsource.o
pcapsource.cc: In member function 'int PcapSource::Radiotap2KisPack(kis_packet*, uint8_t*, uint8_t*)':
pcapsource.cc:611: error: use of enum 'ieee80211_radiotap_type' without previous declaration
pcapsource.cc:611: error: invalid type in declaration before ';' token
pcapsource.cc:619: error: invalid application of 'sizeof' to incomplete type 'ieee80211_radiotap_header'
pcapsource.cc:625: error: invalid use of undefined type 'struct ieee80211_radiotap_header'
pcapsource.cc:608: error: forward declaration of 'struct ieee80211_radiotap_header'
pcapsource.cc:631: error: invalid use of undefined type 'struct ieee80211_radiotap_header'
pcapsource.cc:608: error: forward declaration of 'struct ieee80211_radiotap_header'
pcapsource.cc:632: error: 'IEEE80211_RADIOTAP_EXT' was not declared in this scope
pcapsource.cc:633: error: invalid use of undefined type 'struct ieee80211_radiotap_header'
pcapsource.cc:608: error: forward declaration of 'struct ieee80211_radiotap_header'
pcapsource.cc:637: error: 'IEEE80211_RADIOTAP_EXT' was not declared in this scope
pcapsource.cc:647: error: invalid use of undefined type 'struct ieee80211_radiotap_header'
pcapsource.cc:608: error: forward declaration of 'struct ieee80211_radiotap_header'
pcapsource.cc:654: error: use of enum 'ieee80211_radiotap_type' without previous declaration
pcapsource.cc:658: error: 'IEEE80211_RADIOTAP_FLAGS' was not declared in this scope
pcapsource.cc:659: error: 'IEEE80211_RADIOTAP_RATE' was not declared in this scope
pcapsource.cc:660: error: 'IEEE80211_RADIOTAP_DB_ANTSIGNAL' was not declared in this scope
pcapsource.cc:661: error: 'IEEE80211_RADIOTAP_DB_ANTNOISE' was not declared in this scope
pcapsource.cc:662: error: 'IEEE80211_RADIOTAP_DBM_ANTSIGNAL' was not declared in this scope
pcapsource.cc:663: error: 'IEEE80211_RADIOTAP_DBM_ANTNOISE' was not declared in this scope
pcapsource.cc:664: error: 'IEEE80211_RADIOTAP_ANTENNA' was not declared in this scope
pcapsource.cc:667: error: 'IEEE80211_RADIOTAP_DBM_TX_POWER' was not declared in this scope
pcapsource.cc:670: error: 'IEEE80211_RADIOTAP_CHANNEL' was not declared in this scope
pcapsource.cc:676: error: 'IEEE80211_RADIOTAP_FHSS' was not declared in this scope
pcapsource.cc:677: error: 'IEEE80211_RADIOTAP_LOCK_QUALITY' was not declared in this scope
pcapsource.cc:678: error: 'IEEE80211_RADIOTAP_TX_ATTENUATION' was not declared in this scope
pcapsource.cc:679: error: 'IEEE80211_RADIOTAP_DB_TX_ATTENUATION' was not declared in this scope
pcapsource.cc:683: error: 'IEEE80211_RADIOTAP_TSFT' was not declared in this scope
pcapsource.cc:697: error: 'IEEE80211_RADIOTAP_CHANNEL' was not declared in this scope
pcapsource.cc:714: error: 'IEEE80211_RADIOTAP_RATE' was not declared in this scope
pcapsource.cc:718: error: 'IEEE80211_RADIOTAP_DB_ANTSIGNAL' was not declared in this scope
pcapsource.cc:721: error: 'IEEE80211_RADIOTAP_DB_ANTNOISE' was not declared in this scope
pcapsource.cc:724: error: 'IEEE80211_RADIOTAP_DBM_ANTSIGNAL' was not declared in this scope
pcapsource.cc:727: error: 'IEEE80211_RADIOTAP_DBM_ANTNOISE' was not declared in this scope
pcapsource.cc:730: error: 'IEEE80211_RADIOTAP_FLAGS' was not declared in this scope
pcapsource.cc:779: error: invalid use of undefined type 'struct ieee80211_radiotap_header'
pcapsource.cc:608: error: forward declaration of 'struct ieee80211_radiotap_header'
pcapsource.cc:780: error: invalid use of undefined type 'struct ieee80211_radiotap_header'
pcapsource.cc:608: error: forward declaration of 'struct ieee80211_radiotap_header'
pcapsource.cc:781: error: invalid use of undefined type 'struct ieee80211_radiotap_header'
pcapsource.cc:608: error: forward declaration of 'struct ieee80211_radiotap_header'
make: *** [pcapsource.o] Error 1</code>

I don't understand anything of that. Anyone care to have a look?


Reply to this message