Kismet Wireless

Kismet Forums

 

Posted by:cooma7
Subject:another orinoco gold patched driver problem!
Date:07:36:50 01/08/2006

hi all.

i am sort of new to linux.

i have Mandriva 10.1 with kernel version 2.6.12-12mdksmp

I have a dual core processor, so i guess i have to have the smp version.

anyway,i downloaded the kernel-source version "kernel-source-stripped-2.6-2.6.12-12mdk.i586.rpm"
which was the closes i could find.
and also downloaded orinoco-0.13e-SN-5 drivers.

however when i type "make"

I just get the following errors.

[root@localhost orinoco-0.13e]# make
make -C /lib/modules/2.6.12-12mdksmp/build SUBDIRS=/root/orinoco-0.13e modules
make[1]: Entering directory `/usr/src/linux-2.6.12-12mdk'

WARNING: Symbol version dump /usr/src/linux-2.6.12-12mdk/Module.symvers
is missing; modules will have no dependencies and modversions.

CC [M] /root/orinoco-0.13e/orinoco_cs.o
In file included from /root/orinoco-0.13e/orinoco.h:15,
from /root/orinoco-0.13e/orinoco_cs.c:42:
/root/orinoco-0.13e/hermes.h: In function 'hermes_present':
/root/orinoco-0.13e/hermes.h:368: warning: passing argument 1 of 'readw' makes pointer from integer without a cast
/root/orinoco-0.13e/hermes.h: In function 'hermes_set_irqmask':
/root/orinoco-0.13e/hermes.h:374: warning: passing argument 2 of 'writew' makes pointer from integer without a cast
/root/orinoco-0.13e/hermes.h: In function 'hermes_read_words':
/root/orinoco-0.13e/hermes.h:417: warning: passing argument 1 of 'readw' makes pointer from integer without a cast
/root/orinoco-0.13e/hermes.h: In function 'hermes_write_words':
/root/orinoco-0.13e/hermes.h:437: warning: passing argument 2 of 'writew' makes pointer from integer without a cast
/root/orinoco-0.13e/hermes.h: In function 'hermes_clear_words':
/root/orinoco-0.13e/hermes.h:453: warning: passing argument 2 of 'writew' makes pointer from integer without a cast
/root/orinoco-0.13e/orinoco_cs.c: In function 'orinoco_cs_hard_reset':
/root/orinoco-0.13e/orinoco_cs.c:134: warning: implicit declaration of function 'CardServices'
/root/orinoco-0.13e/orinoco_cs.c: In function 'orinoco_cs_attach':
/root/orinoco-0.13e/orinoco_cs.c:206: error: 'struct dev_link_t' has no member named 'release'
/root/orinoco-0.13e/orinoco_cs.c:207: error: 'struct dev_link_t' has no member named 'release'
/root/orinoco-0.13e/orinoco_cs.c:208: error: 'struct dev_link_t' has no member named 'release'
/root/orinoco-0.13e/orinoco_cs.c: In function 'init_orinoco_cs':
/root/orinoco-0.13e/orinoco_cs.c:688: warning: implicit declaration of function 'register_pccard_driver'
/root/orinoco-0.13e/orinoco_cs.c: In function 'exit_orinoco_cs':
/root/orinoco-0.13e/orinoco_cs.c:696: warning: implicit declaration of function 'unregister_pccard_driver'
make[2]: *** [/root/orinoco-0.13e/orinoco_cs.o] Error 1
make[1]: *** [_module_/root/orinoco-0.13e] Error 2
make[1]: Leaving directory `/usr/src/linux-2.6.12-12mdk'
make: *** [modules] Error 2
[root@localhost orinoco-0.13e]#

-------------------------------------------------------------

I just dont know what to do, i have been trying this for weeks now, with all differnet version drivers and everything else.

does anyone know what the problem is?

please help.

ryan


Reply to this message