Kismet Wireless

Kismet Forums

 

Posted by:dominatordan
Subject:make error on FC4
Date:09:00:39 19/01/2006

[root@linuxmaster kismet-2005-08-R1]# make dep
make[1]: Entering directory `/home/danimal/kismet-2005-08-R1'
make[2]: Entering directory `/home/danimal/kismet-2005-08-R1'
make[2]: `.depend' is up to date.
make[2]: Leaving directory `/home/danimal/kismet-2005-08-R1'
make[1]: Leaving directory `/home/danimal/kismet-2005-08-R1'
[root@linuxmaster kismet-2005-08-R1]# make
g++ -Ilibpcap-0.9.1-kis -O2 -Wall -DVERSION_MAJOR=\"2005\" -DVERSION_MINOR=\"08\" -DVERSION_TINY=\"R1\" -DTIMESTAMP=\"`cat TIMESTAMP`\" -g -O2 -c util.cc -o util.o
g++ -Ilibpcap-0.9.1-kis -O2 -Wall -DVERSION_MAJOR=\"2005\" -DVERSION_MINOR=\"08\" -DVERSION_TINY=\"R1\" -DTIMESTAMP=\"`cat TIMESTAMP`\" -g -O2 -c ringbuf.cc -o ringbuf.o
g++ -Ilibpcap-0.9.1-kis -O2 -Wall -DVERSION_MAJOR=\"2005\" -DVERSION_MINOR=\"08\" -DVERSION_TINY=\"R1\" -DTIMESTAMP=\"`cat TIMESTAMP`\" -g -O2 -c configfile.cc -o configfile.o


blah blah blah

And then I get this error....

g++ -Ilibpcap-0.9.1-kis -O2 -Wall -DVERSION_MAJOR=\"2005\" -DVERSION_MINOR=\"08\" -DVERSION_TINY=\"R1\" -DTIMESTAMP=\"`cat TIMESTAMP`\" -g -O2 -c cursesfront.cc -o cursesfront.o
In file included from cursesfront.cc:20:
cursesfront.h:32:21: error: ncurses.h: No such file or directory
cursesfront.h:84: error: ISO C++ forbids declaration of ‘WINDOW’ with no type
cursesfront.h:84: error: expected ‘;’ before ‘*’ token
cursesfront.cc: In member function ‘virtual int NCurseFront::InitDisplay(int, time_t)’:
cursesfront.cc:46: error: ‘initscr’ was not declared in this scope
cursesfront.cc:48: error: ‘netborder’ was not declared in this scope
cursesfront.cc:48: error: ‘stdscr’ was not declared in this scope
cursesfront.cc:48: error: ‘LINES’ was not declared in this scope
cursesfront.cc:48: error: ‘COLS’ was not declared in this scope
cursesfront.cc:48: error: ‘subwin’ was not declared in this scope
cursesfront.cc:49: error: ‘netwin’ was not declared in this scope
cursesfront.cc:50: error: ‘infoborder’ was not declared in this scope
cursesfront.cc:54: error: ‘infowin’ was not declared in this scope
cursesfront.cc:57: error: ‘statusborder’ was not declared in this scope
cursesfront.cc:59: error: ‘statuswin’ was not declared in this scope
cursesfront.cc:60: error: ‘scrollok’ was not declared in this scope
cursesfront.cc: In member function ‘virtual int NCurseFront::WriteStatus(std::string)’:
cursesfront.cc:69: error: ‘statuswin’ was not declared in this scope
cursesfront.cc:69: error: ‘winsertln’ was not declared in this scope
cursesfront.cc:70: error: ‘COLS’ was not declared in this scope
cursesfront.cc:70: error: ‘mvwaddstr’ was not declared in this scope
cursesfront.cc: In member function ‘virtual int NCurseFront::DrawDisplay()’:
cursesfront.cc:81: error: ‘netborder’ was not declared in this scope
cursesfront.cc:81: error: ‘box’ was not declared in this scope
cursesfront.cc:82: error: ‘mvwaddstr’ was not declared in this scope
cursesfront.cc:83: error: ‘COLS’ was not declared in this scope
cursesfront.cc:113: error: ‘LINES’ was not declared in this scope
cursesfront.cc:117: error: ‘infoborder’ was not declared in this scope
cursesfront.cc:120: error: ‘LINES’ was not declared in this scope
cursesfront.cc:120: error: ‘mvwaddch’ was not declared in this scope
cursesfront.cc:124: error: ‘statusborder’ was not declared in this scope
cursesfront.cc:129: error: ‘infowin’ was not declared in this scope
cursesfront.cc:129: error: ‘werase’ was not declared in this scope
cursesfront.cc:167: error: ‘netwin’ was not declared in this scope
cursesfront.cc:184: error: ‘COLS’ was not declared in this scope
cursesfront.cc:213: error: ‘COLS’ was not declared in this scope
cursesfront.cc:237: error: ‘COLS’ was not declared in this scope
cursesfront.cc:268: error: ‘wrefresh’ was not declared in this scope
cursesfront.cc:271: error: ‘statuswin’ was not declared in this scope
cursesfront.cc:274: error: ‘refresh’ was not declared in this scope
cursesfront.cc: In member function ‘virtual int NCurseFront::EndDisplay()’:
cursesfront.cc:282: error: ‘endwin’ was not declared in this scope
make: *** [cursesfront.o] Error 1


Any tips from the masters?

Thanks


Reply to this message